Target
Leucine-rich repeat serine/threonine-protein kinase 2
Ligand
BDBM254929
Substrate
Meas. Tech.
ChEMBL_1681543 (CHEMBL4031820)
Ki
0.500000±n/a nM
Citation
 Williamson, DSSmith, GPAcheson-Dossang, PBedford, STChell, VChen, IJDaechsel, JCADaniels, ZDavid, LDokurno, PHentzer, MHerzig, MCHubbard, REMoore, JDMurray, JBNewland, SRay, SCShaw, TSurgenor, AETerry, LThirstrup, KWang, YChristensen, KV Design of Leucine-Rich Repeat Kinase 2 (LRRK2) Inhibitors Using a Crystallographic Surrogate Derived from Checkpoint Kinase 1 (CHK1). J Med Chem 60:8945-8962 (2017)  
Target
Name:
Leucine-rich repeat serine/threonine-protein kinase 2
Synonyms:
Dardarin LRRK2_HUMAN Leucine-rich repeat serine/threonine-protein kinase 2 PARK8
Type:
Protein
Mol. Mass.:
286113.20
Organism:
Homo sapiens (Human)
Description:
Q5S007
Residue:
2527
  
Inhibitor
Name:
BDBM254929
Synonyms:
US9499542, 12 | US9675594, 12
Type:
Small organic molecule
Emp. Form.:
C15H12N4
Mol. Mass.:
248.2826
SMILES:
Cc1cccc(c1)-c1cc(N)nc2[nH]cc(C#N)c12
: