Target
Muscarinic acetylcholine receptor M1
Ligand
BDBM50005854
Substrate
Meas. Tech.
ChEMBL_138959 (CHEMBL742771)
Ki
2250±n/a nM
Citation
 Garvey, DSWasicak, JTChung, JYShue, YKCarrera, GMMay, PDMcKinney, MMAnderson, DCadman, EVella-Rountree, L Synthesis and in vitro characterization of novel amino terminally modified oxotremorine derivatives for brain muscarinic receptors. J Med Chem 35:1550-7 (1992)  
Target
Name:
Muscarinic acetylcholine receptor M1
Synonyms:
ACM1_RAT Chrm-1 cholinergic receptor, muscarinic 1
Type:
Enzyme Catalytic Domain
Mol. Mass.:
51390.46
Organism:
RAT
Description:
P08482
Residue:
460
  
Inhibitor
Name:
BDBM50005854
Synonyms:
1-(4-Azetidin-1-yl-but-2-ynyl)-pyrrolidin-2-one | CHEMBL38441
Type:
Small organic molecule
Emp. Form.:
C11H16N2O
Mol. Mass.:
192.2575
SMILES:
O=C1CCCN1CC#CCN1CCC1
: