Target
Metabotropic glutamate receptor 6
Ligand
BDBM50255390
Substrate
Meas. Tech.
ChEMBL_1687021 (CHEMBL4037500)
EC50
4000±n/a nM
Citation
 Selvam, CLemasson, IABrabet, IOueslati, NKaraman, BCabaye, ATora, ASCommare, BCourtiol, TCesarini, SMcCort-Tranchepain, IRigault, DMony, LBessiron, TMcLean, HLeroux, FRColobert, FDaniel, HGoupil-Lamy, ABertrand, HOGoudet, CPin, JPAcher, FC Increased Potency and Selectivity for Group III Metabotropic Glutamate Receptor Agonists Binding at Dual sites. J Med Chem 61:1969-1989 (2018)  
Target
Name:
Metabotropic glutamate receptor 6
Synonyms:
GPRC1F GRM6_HUMAN Metabotropic glutamate receptor 6 metabotropic glutamate 6
Type:
Enzyme Catalytic Domain
Mol. Mass.:
95479.26
Organism:
Homo sapiens (Human)
Description:
metabotropic glutamate 6 GRM6 HUMAN::O15303
Residue:
877
  
Inhibitor
Name:
BDBM50255390
Synonyms:
CHEMBL4091029
Type:
Small organic molecule
Emp. Form.:
C11H14FN2O7P
Mol. Mass.:
336.2102
SMILES:
N[C@@H](CCP(O)(=O)C(O)c1ccc(F)c(c1)[N+]([O-])=O)C(O)=O
: