Target
Metabotropic glutamate receptor 7
Ligand
BDBM50255390
Substrate
Meas. Tech.
ChEBML_1687018
EC50
>100000±n/a nM
Citation
 Selvam, CLemasson, IABrabet, IOueslati, NKaraman, BCabaye, ATora, ASCommare, BCourtiol, TCesarini, SMcCort-Tranchepain, IRigault, DMony, LBessiron, TMcLean, HLeroux, FRColobert, FDaniel, HGoupil-Lamy, ABertrand, HOGoudet, CPin, JPAcher, FC Increased Potency and Selectivity for Group III Metabotropic Glutamate Receptor Agonists Binding at Dual sites. J Med Chem 61:1969-1989 (2018)  
Target
Name:
Metabotropic glutamate receptor 7
Synonyms:
GPRC1G GRM7 protein MGLUR7 metabotropic glutamate 7
Type:
Enzyme Catalytic Domain
Mol. Mass.:
102262.98
Organism:
Homo sapiens (Human)
Description:
Q14831
Residue:
915
  
Inhibitor
Name:
BDBM50255390
Synonyms:
CHEMBL4091029
Type:
Small organic molecule
Emp. Form.:
C11H14FN2O7P
Mol. Mass.:
336.2102
SMILES:
N[C@@H](CCP(O)(=O)C(O)c1ccc(F)c(c1)[N+]([O-])=O)C(O)=O
: