Target
Metabotropic glutamate receptor 8
Ligand
BDBM50255390
Substrate
Meas. Tech.
ChEBML_1687020
EC50
1300±n/a nM
Citation
 Selvam, CLemasson, IABrabet, IOueslati, NKaraman, BCabaye, ATora, ASCommare, BCourtiol, TCesarini, SMcCort-Tranchepain, IRigault, DMony, LBessiron, TMcLean, HLeroux, FRColobert, FDaniel, HGoupil-Lamy, ABertrand, HOGoudet, CPin, JPAcher, FC Increased Potency and Selectivity for Group III Metabotropic Glutamate Receptor Agonists Binding at Dual sites. J Med Chem 61:1969-1989 (2018)  
Target
Name:
Metabotropic glutamate receptor 8
Synonyms:
GPRC1H GRM8_HUMAN Metabotropic glutamate receptor 8 | metabotropic glutamate 8
Type:
Enzyme Catalytic Domain
Mol. Mass.:
101759.58
Organism:
Homo sapiens (Human)
Description:
metabotropic glutamate 8 GRM8 HUMAN::O00222
Residue:
908
  
Inhibitor
Name:
BDBM50255390
Synonyms:
CHEMBL4091029
Type:
Small organic molecule
Emp. Form.:
C11H14FN2O7P
Mol. Mass.:
336.2102
SMILES:
N[C@@H](CCP(O)(=O)C(O)c1ccc(F)c(c1)[N+]([O-])=O)C(O)=O
: