Target
Metabotropic glutamate receptor 4
Ligand
BDBM50255390
Substrate
Meas. Tech.
ChEMBL_1687019 (CHEMBL4037498)
EC50
440±n/a nM
Citation
 Selvam, CLemasson, IABrabet, IOueslati, NKaraman, BCabaye, ATora, ASCommare, BCourtiol, TCesarini, SMcCort-Tranchepain, IRigault, DMony, LBessiron, TMcLean, HLeroux, FRColobert, FDaniel, HGoupil-Lamy, ABertrand, HOGoudet, CPin, JPAcher, FC Increased Potency and Selectivity for Group III Metabotropic Glutamate Receptor Agonists Binding at Dual sites. J Med Chem 61:1969-1989 (2018)  
Target
Name:
Metabotropic glutamate receptor 4
Synonyms:
GPRC1D GRM4_HUMAN MGLUR4 Metabotropic glutamate receptor 4 (mGlu4) metabotropic glutamate 4
Type:
Protein
Mol. Mass.:
101899.95
Organism:
Homo sapiens (Human)
Description:
Q14833
Residue:
912
  
Inhibitor
Name:
BDBM50255390
Synonyms:
CHEMBL4091029
Type:
Small organic molecule
Emp. Form.:
C11H14FN2O7P
Mol. Mass.:
336.2102
SMILES:
N[C@@H](CCP(O)(=O)C(O)c1ccc(F)c(c1)[N+]([O-])=O)C(O)=O
: