Target
Potassium voltage-gated channel subfamily H member 2
Ligand
BDBM50257272
Substrate
Meas. Tech.
ChEMBL_1689733 (CHEMBL4040303)
IC50
>100000±n/a nM
Citation
 Unwalla, RMousseau, JJFadeyi, OOChoi, CParris, KHu, BKenney, TChippari, SMcNally, CVishwanathan, KKilbourne, EThompson, CNagpal, SWrobel, JYudt, MMorris, CAPowell, DGilbert, AMChekler, ELP Structure-Based Approach To Identify 5-[4-Hydroxyphenyl]pyrrole-2-carbonitrile Derivatives as Potent and Tissue Selective Androgen Receptor Modulators. J Med Chem 60:6451-6457 (2017)  
Target
Name:
Potassium voltage-gated channel subfamily H member 2
Synonyms:
1,3-beta-glucan synthase component GLS2 ERG Eag-related protein 1 Ether-a-go-go-related gene (HERG) Ether-a-go-go-related gene potassium channel 1 Ether-a-go-go-related gene potassium channel 1 (hERG1) Ether-a-go-go-related protein 1 H-ERG KCNH2 Potassium voltage-gated channel subfamily H member 2 (hERG) Voltage-gated potassium channel subunit Kv11.1 hERG Potassium Channel 1 | putative potassium channel subunit
Type:
Multi-pass membrane protein
Mol. Mass.:
126672.65
Organism:
Homo sapiens (Human)
Description:
Q12809
Residue:
1159
  
Inhibitor
Name:
BDBM50257272
Synonyms:
CHEMBL4095883
Type:
Small organic molecule
Emp. Form.:
C12H9FN2O
Mol. Mass.:
216.2111
SMILES:
Cn1c(ccc1-c1ccc(O)cc1F)C#N
: