Target
Serine/threonine-protein kinase WNK1
Ligand
BDBM50258546
Substrate
Meas. Tech.
ChEMBL_1690571 (CHEMBL4041141)
Ki
32±n/a nM
Citation
 Yamada, KLevell, JYoon, TKohls, DYowe, DRigel, DFImase, HYuan, JYasoshima, KDiPetrillo, KMonovich, LXu, LZhu, MKato, MJain, MIdamakanti, NTaslimi, PKawanami, TArgikar, UAKunjathoor, VXie, XYagi, YIIwaki, YRobinson, ZPark, HM Optimization of Allosteric With-No-Lysine (WNK) Kinase Inhibitors and Efficacy in Rodent Hypertension Models. J Med Chem 60:7099-7107 (2017)  
Target
Name:
Serine/threonine-protein kinase WNK1
Synonyms:
Erythrocyte 65 kDa protein KDP Kinase deficient protein Protein kinase lysine-deficient 1 WNK1 hWNK1 | p65
Type:
PROTEIN
Mol. Mass.:
250784.18
Organism:
Homo sapiens (Human)
Description:
ChEMBL_876549
Residue:
2382
  
Inhibitor
Name:
BDBM50258546
Synonyms:
CHEMBL4087727
Type:
Small organic molecule
Emp. Form.:
C29H32N2O
Mol. Mass.:
424.5772
SMILES:
COc1cccc(c1)-c1cccc(c1)-n1cc(CNCC2CCCCC2)c2ccccc12
: