Target
Potassium voltage-gated channel subfamily H member 2
Ligand
BDBM50266776
Substrate
Meas. Tech.
ChEMBL_1701313 (CHEMBL4052295)
IC50
3800±n/a nM
Citation
 Thompson, AMO'Connor, PDMarshall, AJYardley, VMaes, LGupta, SLaunay, DBraillard, SChatelain, EFranzblau, SGWan, BWang, YMa, ZCooper, CBDenny, WA 7-Substituted 2-Nitro-5,6-dihydroimidazo[2,1-b][1,3]oxazines: Novel Antitubercular Agents Lead to a New Preclinical Candidate for Visceral Leishmaniasis. J Med Chem 60:4212-4233 (2017)  
Target
Name:
Potassium voltage-gated channel subfamily H member 2
Synonyms:
1,3-beta-glucan synthase component GLS2 ERG Eag-related protein 1 Ether-a-go-go-related gene (HERG) Ether-a-go-go-related gene potassium channel 1 Ether-a-go-go-related gene potassium channel 1 (hERG1) Ether-a-go-go-related protein 1 H-ERG KCNH2 Potassium voltage-gated channel subfamily H member 2 (hERG) Voltage-gated potassium channel subunit Kv11.1 hERG Potassium Channel 1 | putative potassium channel subunit
Type:
Multi-pass membrane protein
Mol. Mass.:
126672.65
Organism:
Homo sapiens (Human)
Description:
Q12809
Residue:
1159
  
Inhibitor
Name:
BDBM50266776
Synonyms:
CHEMBL4066553
Type:
Small organic molecule
Emp. Form.:
C15H14F3N3O5
Mol. Mass.:
373.284
SMILES:
CC1(COc2ccc(OC(F)(F)F)cc2)CCn2cc(nc2O1)[N+]([O-])=O
: