Target
Renin
Ligand
BDBM50012932
Substrate
Meas. Tech.
ChEBML_195977
IC50
1.9±n/a nM
Citation
 Roberts, DABradbury, RHBrown, DFaull, AGriffiths, DMajor, JSOldham, AAPearce, RJRatcliffe, AHRevill, J 1,2,4-Triazolo[4,3-a]pyrazine derivatives with human renin inhibitory activity. 1. Synthesis and biological properties of alkyl alcohol and statine derivatives. J Med Chem 33:2326-34 (1990)  
Target
Name:
Renin
Synonyms:
Angiotensinogenase RENI_HUMAN
Type:
Enzyme
Mol. Mass.:
45058.99
Organism:
Homo sapiens (Human)
Description:
Residue:
406
  
Inhibitor
Name:
BDBM50012932
Synonyms:
4-(1-{1-Cyclohexylmethyl-2-hydroxy-4-[2-(8-isobutyl-6-phenyl-[1,2,4]triazolo[4,3-a]pyrazin-3-yl)-3-pyridin-3-yl-propionylamino]-4-oxo-butylcarbamoyl}-3-methyl-butylamino)-butyric acid . 2H2O | CHEMBL305692
Type:
Small organic molecule
Emp. Form.:
C44H60N8O6
Mol. Mass.:
796.9972
SMILES:
CC(C)CC(NCCCC(O)=O)C(=O)N[C@@H](CC1CCCCC1)[C@@H](O)CC(=O)NC(=O)C(Cc1cccnc1)c1nnc2c(CC(C)C)nc(cn12)-c1ccccc1
: