Target
Dipeptidyl peptidase IV
Ligand
BDBM12195
Substrate
Meas. Tech.
ChEBML_1717756
IC50
10000±n/a nM
Citation
 Rea, DVan Elzen, RDe Winter, HVan Goethem, SLanduyt, BLuyten, WSchoofs, LVan Der Veken, PAugustyns, KDe Meester, IFülöp, VLambeir, AM Crystal structure of Porphyromonas gingivalis dipeptidyl peptidase 4 and structure-activity relationships based on inhibitor profiling. Eur J Med Chem 139:482-491 (2017)  
Target
Name:
Dipeptidyl peptidase IV
Synonyms:
DPP IV
Type:
PROTEIN
Mol. Mass.:
82026.01
Organism:
Porphyromonas gingivalis
Description:
ChEMBL_117804
Residue:
723
  
Inhibitor
Name:
BDBM12195
Synonyms:
2-amino-4-{4-[bis(4-fluorophenyl)methyl]piperazin-1-yl}-1-(2,3-dihydro-1H-isoindol-2-yl)butane-1,4-dione | isoquinoline derivative 18
Type:
Small organic molecule
Emp. Form.:
C29H30F2N4O2
Mol. Mass.:
504.5709
SMILES:
NC(CC(=O)N1CCN(CC1)C(c1ccc(F)cc1)c1ccc(F)cc1)C(=O)N1Cc2ccccc2C1
: