Target
Dihydroorotate dehydrogenase (quinone), mitochondrial
Ligand
BDBM50235593
Substrate
Meas. Tech.
ChEMBL_1722384 (CHEMBL4137384)
IC50
45±n/a nM
Citation
 Sainas, SPippione, ACLupino, EGiorgis, MCircosta, PGaidano, VGoyal, PBonanni, DRolando, BCignetti, ADucime, AAndersson, MJärvå, MFriemann, RPiccinini, MRamondetti, CBuccinnà, BAl-Karadaghi, SBoschi, DSaglio, GLolli, ML Targeting Myeloid Differentiation Using Potent 2-Hydroxypyrazolo[1,5- a]pyridine Scaffold-Based Human Dihydroorotate Dehydrogenase Inhibitors. J Med Chem 61:6034-6055 (2018)  
Target
Name:
Dihydroorotate dehydrogenase (quinone), mitochondrial
Synonyms:
DHODH Dihydroorotate dehydrogenase Dihydroorotate dehydrogenase, mitochondrial Dihydroorotate oxidase (DHODH) | PYRD_HUMAN
Type:
Enzyme
Mol. Mass.:
42881.33
Organism:
Homo sapiens (Human)
Description:
Q02127
Residue:
395
  
Inhibitor
Name:
BDBM50235593
Synonyms:
CHEMBL4062046
Type:
Small organic molecule
Emp. Form.:
C16H10F4N4O2
Mol. Mass.:
366.2698
SMILES:
Cn1nc(O)c(n1)C(=O)Nc1c(F)c(F)c(-c2ccccc2)c(F)c1F
: