Target
Tolloid-like protein 2
Ligand
BDBM50458771
Substrate
Meas. Tech.
ChEMBL_1764657 (CHEMBL4199904)
Ki
0.26±n/a nM
Citation
 Kallander, LSWashburn, DHilfiker, MAEidam, HSLawhorn, BGPrendergast, JFox, RDowdell, SManns, SHoang, TZhao, SYe, GHammond, MHolt, DARoethke, THong, XReid, RAGampe, RZhang, HDiaz, ERendina, ARQuinn, AMWillette, B Reverse Hydroxamate Inhibitors of Bone Morphogenetic Protein 1. ACS Med Chem Lett 9:736-740 (2018)  
Target
Name:
Tolloid-like protein 2
Synonyms:
3.4.24.- TLL2 Tolloid-like protein 2
Type:
PROTEIN
Mol. Mass.:
113541.82
Organism:
Homo sapiens
Description:
ChEMBL_118240
Residue:
1015
  
Inhibitor
Name:
BDBM50458771
Synonyms:
CHEMBL4214046
Type:
Small organic molecule
Emp. Form.:
C25H36N3O9P
Mol. Mass.:
553.5418
SMILES:
CCCCC[C@H]([C@@H](CC)N(O)C=O)C(=O)NCNC(=O)c1ccc(o1)-c1cc(OCC)cc(c1)P(O)(O)=O
: