Target
Tyrosine-protein kinase BTK
Ligand
BDBM50459580
Substrate
Meas. Tech.
ChEMBL_1766677 (CHEMBL4201924)
IC50
2.2±n/a nM
Citation
 Kawahata, WAsami, TKiyoi, TIrie, TTaniguchi, HAsamitsu, YInoue, TMiyake, TSawa, M Design and Synthesis of Novel Amino-triazine Analogues as Selective Bruton's Tyrosine Kinase Inhibitors for Treatment of Rheumatoid Arthritis. J Med Chem 61:8917-8933 (2018)  
Target
Name:
Tyrosine-protein kinase BTK
Synonyms:
AGMX1 Agammaglobulinaemia tyrosine kinase B cell progenitor kinase BPK BTK_HUMAN Tyrosine Kinase BTK Tyrosine-protein kinase BTK (BTK)
Type:
Enzyme
Mol. Mass.:
76289.95
Organism:
Homo sapiens (Human)
Description:
Q06187
Residue:
659
  
Inhibitor
Name:
BDBM50459580
Synonyms:
CHEMBL4211893
Type:
Small organic molecule
Emp. Form.:
C30H29FN8O2
Mol. Mass.:
552.6021
SMILES:
CC(C1CC1)n1cc(Nc2nc(N)nc(n2)-c2cccc(c2CO)-n2ccc3cc(cc(F)c3c2=O)C2CC2)cn1
: