Target
Lysine-specific demethylase 5B
Ligand
BDBM264021
Substrate
Meas. Tech.
ChEMBL_1771179 (CHEMBL4223291)
IC50
4.0±n/a nM
Citation
 Nie, ZShi, LLai, CO'Connell, SMXu, JStansfield, RKHosfield, DJVeal, JMStafford, JA Structure-based design and discovery of potent and selective KDM5 inhibitors. Bioorg Med Chem Lett 28:1490-1494 (2018)  
Target
Name:
Lysine-specific demethylase 5B
Synonyms:
CT31 Histone demethylase JARID1B Jumonji/ARID domain-containing protein 1B KDM5B_HUMAN Lysine-specific demethylase 5B (KDM5Flag-5B-FL) PLU1 RBP2-H1 | Retinoblastoma-binding protein 2 homolog 1
Type:
Protein
Mol. Mass.:
175659.67
Organism:
Homo sapiens (Human)
Description:
Q9UGL1
Residue:
1544
  
Inhibitor
Name:
BDBM264021
Synonyms:
2-[5-[(4-chloro-2- phenylmethoxyphenyl)methoxy] pyrazol-1-yl]pyridine-4-carboxylic acid US9604961, Example 105 US9908865, Example 105
Type:
Small organic molecule
Emp. Form.:
C23H18ClN3O4
Mol. Mass.:
435.86
SMILES:
OC(=O)c1ccnc(c1)-n1nccc1OCc1ccc(Cl)cc1OCc1ccccc1
: