Target
Lysine-specific demethylase 5A
Ligand
BDBM264022
Substrate
Meas. Tech.
ChEMBL_1771178 (CHEMBL4223290)
IC50
75±n/a nM
Citation
 Nie, ZShi, LLai, CO'Connell, SMXu, JStansfield, RKHosfield, DJVeal, JMStafford, JA Structure-based design and discovery of potent and selective KDM5 inhibitors. Bioorg Med Chem Lett 28:1490-1494 (2018)  
Target
Name:
Lysine-specific demethylase 5A
Synonyms:
Histone demethylase JARID1A Jumonji/ARID domain-containing protein 1A KDM5A_HUMAN RBBP-2 RBP2 | Retinoblastoma-binding protein 2
Type:
Protein
Mol. Mass.:
192091.79
Organism:
Homo sapiens (Human)
Description:
P29375
Residue:
1690
  
Inhibitor
Name:
BDBM264022
Synonyms:
2-[5-[[4-chloro-2- (cyclopropylmethoxy(phenyl] methoxy]pyrazol-1-yl]pyridine- 4-carboxylic acid US9604961, Example 106 US9908865, Example 106
Type:
Small organic molecule
Emp. Form.:
C20H18ClN3O4
Mol. Mass.:
399.828
SMILES:
OC(=O)c1ccnc(c1)-n1nccc1OCc1ccc(Cl)cc1OCC1CC1
: