Target
Glycogen synthase kinase-3 beta
Ligand
BDBM3175
Substrate
Meas. Tech.
ChEMBL_1777422 (CHEMBL4234414)
IC50
6.8±n/a nM
Citation
 Winfield, HJCahill, MMO'Shea, KDPierce, LTRobert, TRuchaud, SBach, SMarchand, PMcCarthy, FO Synthesis and anticancer activity of novel bisindolylhydroxymaleimide derivatives with potent GSK-3 kinase inhibition. Bioorg Med Chem 26:4209-4224 (2018)  
Target
Name:
Glycogen synthase kinase-3 beta
Synonyms:
GSK-3, beta Glycogen Synthase Kinase-3, beta | Gsk3b
Type:
Enzyme
Mol. Mass.:
46754.43
Organism:
Rattus norvegicus (rat)
Description:
The rat GSK-3 beta cDNA was inserted into the baculovirus vector. The protein was purified from virus-infected sf9 insect cells
Residue:
420
  
Inhibitor
Name:
BDBM3175
Synonyms:
3-[1-[3-(Amidinothio)propyl]-3-indolyl]-4-(1-methyl-3-indolyl)-1H-pyrrole-2,5-dione Methanesulfonate Bisindolylmaleimide 11b CHEMBL6291 Ro 31-8220 [(3-{3-[4-(1-methyl-1H-indol-3-yl)-2,5-dioxo-2,5-dihydro-1H-pyrrol-3-yl]-1H-indol-1-yl}propyl)sulfanyl]methanimidamide
Type:
Small organic molecule
Emp. Form.:
C25H23N5O2S
Mol. Mass.:
457.547
SMILES:
Cn1cc(C2=C(C(=O)NC2=O)c2cn(CCCSC(N)=N)c3ccccc23)c2ccccc12
: