Target
Dihydrofolate reductase
Ligand
BDBM18050
Substrate
Meas. Tech.
ChEMBL_54600 (CHEMBL667323)
Ki
0.00581±n/a nM
Citation
 Piper, JRMcCaleb, GSMontgomery, JASchmid, FASirotnak, FM Syntheses and evaluation as antifolates of MTX analogues derived from 2, omega-diaminoalkanoic acids. J Med Chem 28:1016-25 (1985)  
Target
Name:
Dihydrofolate reductase
Synonyms:
DYR_MOUSE | Dhfr
Type:
Enzyme
Mol. Mass.:
21608.82
Organism:
Mus musculus (Mouse)
Description:
Residue:
187
  
Inhibitor
Name:
BDBM18050
Synonyms:
2-[(4-{[(2,4-diaminopteridin-6-yl)methyl](methyl)amino}phenyl)formamido]pentanedioic acid MTX cid_126941
Type:
Small organic molecule
Emp. Form.:
C20H22N8O5
Mol. Mass.:
454.4393
SMILES:
CN(Cc1cnc2nc(N)nc(N)c2n1)c1ccc(cc1)C(=O)N[C@@H](CCC(O)=O)C(O)=O
: