Target
Presenilin-1
Ligand
BDBM50476863
Substrate
Meas. Tech.
ChEMBL_447416 (CHEMBL896440)
IC50
280±n/a nM
Citation
 Yang, MGShi, JLModi, DPWells, JCochran, BMWolf, MAThompson, LARamanjulu, MMRoach, AHZaczek, RRobertson, DWWexler, RROlson, RE Design and synthesis of benzoazepinone-derived cyclic malonamides and aminoamides as potent gamma-secretase inhibitors. Bioorg Med Chem Lett 17:3910-5 (2007)  
Target
Name:
Presenilin-1
Synonyms:
3.4.23.- Gamma-Secretase Subunit Presenilin-1 PS1 PSEN1 PSNL1 Presenilin-1 CTF12 Protein S182
Type:
Mol. Mass.:
52657.13
Organism:
Homo sapiens (Human)
Description:
P49768
Residue:
467
  
Inhibitor
Name:
BDBM50476863
Synonyms:
CHEMBL273493
Type:
Small organic molecule
Emp. Form.:
C30H33F3N4O4
Mol. Mass.:
570.6026
SMILES:
CN1c2ccccc2C(=N[C@H](NC(=O)C2(CCC2)C(=O)N[C@H](O)C2CCCCC2)C1=O)c1ccc(cc1)C(F)(F)F
: