Target
DNA gyrase subunit A
Ligand
BDBM50478005
Substrate
Meas. Tech.
ChEMBL_464479 (CHEMBL948210)
IC50
123000±n/a nM
Citation
 Dinakaran, MSenthilkumar, PYogeeswari, PChina, ANagaraja, VSriram, D Novel ofloxacin derivatives: synthesis, antimycobacterial and toxicological evaluation. Bioorg Med Chem Lett 18:1229-36 (2008)  
Target
Name:
DNA gyrase subunit A
Synonyms:
5.6.2.2 GYRA_MYCSM | gyrA
Type:
PROTEIN
Mol. Mass.:
94927.62
Organism:
Mycobacterium smegmatis
Description:
ChEMBL_102869
Residue:
854
  
Inhibitor
Name:
BDBM50478005
Synonyms:
CHEMBL270238
Type:
Small organic molecule
Emp. Form.:
C20H21FN2O6
Mol. Mass.:
404.3889
SMILES:
CC1COc2c(N3CCC4(CC3)OCCO4)c(F)cc3c2n1cc(C(O)=O)c3=O
: