Target
Presenilin-1
Ligand
BDBM50481068
Substrate
Meas. Tech.
ChEMBL_599754 (CHEMBL1048198)
IC50
0.370000±n/a nM
Citation
 Truong, APAubele, DLProbst, GDNeitzel, MLSemko, CMBowers, SDressen, DHom, RKKonradi, AWSham, HLGarofalo, AWKeim, PSWu, JDappen, MSWong, KGoldbach, EQuinn, KPSauer, JMBrigham, EFWallace, WNguyen, LHemphill, SSBova, MPBard, FYednock, TABasi, G Design, synthesis, and structure-activity relationship of novel orally efficacious pyrazole/sulfonamide based dihydroquinoline gamma-secretase inhibitors. Bioorg Med Chem Lett 19:4920-3 (2009)  
Target
Name:
Presenilin-1
Synonyms:
3.4.23.- Gamma-Secretase Subunit Presenilin-1 PS1 PSEN1 PSNL1 Presenilin-1 CTF12 Protein S182
Type:
Mol. Mass.:
52657.13
Organism:
Homo sapiens (Human)
Description:
P49768
Residue:
467
  
Inhibitor
Name:
BDBM50481068
Synonyms:
CHEMBL584113
Type:
Small organic molecule
Emp. Form.:
C20H15F4N3O3S
Mol. Mass.:
453.41
SMILES:
Fc1ccc2N(C(C3CC3)c3c[nH]nc3-c2c1)S(=O)(=O)c1ccc(OC(F)(F)F)cc1
: