Target
Presenilin-1
Ligand
BDBM50481079
Substrate
Meas. Tech.
ChEMBL_599754 (CHEMBL1048198)
IC50
0.670000±n/a nM
Citation
 Truong, APAubele, DLProbst, GDNeitzel, MLSemko, CMBowers, SDressen, DHom, RKKonradi, AWSham, HLGarofalo, AWKeim, PSWu, JDappen, MSWong, KGoldbach, EQuinn, KPSauer, JMBrigham, EFWallace, WNguyen, LHemphill, SSBova, MPBard, FYednock, TABasi, G Design, synthesis, and structure-activity relationship of novel orally efficacious pyrazole/sulfonamide based dihydroquinoline gamma-secretase inhibitors. Bioorg Med Chem Lett 19:4920-3 (2009)  
Target
Name:
Presenilin-1
Synonyms:
3.4.23.- Gamma-Secretase Subunit Presenilin-1 PS1 PSEN1 PSNL1 Presenilin-1 CTF12 Protein S182
Type:
Mol. Mass.:
52657.13
Organism:
Homo sapiens (Human)
Description:
P49768
Residue:
467
  
Inhibitor
Name:
BDBM50481079
Synonyms:
CHEMBL585538
Type:
Small organic molecule
Emp. Form.:
C19H14F4N4O2S
Mol. Mass.:
438.399
SMILES:
Fc1ccc2N([C@H](C3CC3)c3c[nH]nc3-c2c1)S(=O)(=O)c1ccc(cn1)C(F)(F)F
: