Target
Presenilin-1
Ligand
BDBM50481085
Substrate
Meas. Tech.
ChEMBL_599754 (CHEMBL1048198)
IC50
2.0±n/a nM
Citation
 Truong, APAubele, DLProbst, GDNeitzel, MLSemko, CMBowers, SDressen, DHom, RKKonradi, AWSham, HLGarofalo, AWKeim, PSWu, JDappen, MSWong, KGoldbach, EQuinn, KPSauer, JMBrigham, EFWallace, WNguyen, LHemphill, SSBova, MPBard, FYednock, TABasi, G Design, synthesis, and structure-activity relationship of novel orally efficacious pyrazole/sulfonamide based dihydroquinoline gamma-secretase inhibitors. Bioorg Med Chem Lett 19:4920-3 (2009)  
Target
Name:
Presenilin-1
Synonyms:
3.4.23.- Gamma-Secretase Subunit Presenilin-1 PS1 PSEN1 PSNL1 Presenilin-1 CTF12 Protein S182
Type:
Mol. Mass.:
52657.13
Organism:
Homo sapiens (Human)
Description:
P49768
Residue:
467
  
Inhibitor
Name:
BDBM50481085
Synonyms:
CHEMBL584329
Type:
Small organic molecule
Emp. Form.:
C18H16ClN3O3S
Mol. Mass.:
389.856
SMILES:
COc1ccc2-c3n[nH]cc3C(C)N(c2c1)S(=O)(=O)c1ccc(Cl)cc1
: