Target
Alpha-1,2-mannosidase, putative
Ligand
BDBM36373
Substrate
Meas. Tech.
ChEMBL_662781 (CHEMBL1252520)
Ki
5800000±n/a nM
Citation
 Zhu, YSuits, MDThompson, AJChavan, SDinev, ZDumon, CSmith, NMoremen, KWXiang, YSiriwardena, AWilliams, SJGilbert, HJDavies, GJ Mechanistic insights into a Ca2+-dependent family of alpha-mannosidases in a human gut symbiont. Nat Chem Biol 6:125-32 (2010)  
Target
Name:
Alpha-1,2-mannosidase, putative
Synonyms:
Alpha-1,2-mannosidase, putative
Type:
PROTEIN
Mol. Mass.:
87740.67
Organism:
Bacteroides thetaiotaomicron
Description:
ChEMBL_117209
Residue:
782
  
Inhibitor
Name:
BDBM36373
Synonyms:
(5R,6R,7S,8R)-5,6,7,8-Tetrahydro-5-(hydroxymethyl)-imidazo[1,2-a]pyridine-6,7,8-triol. 1a | CID10013016
Type:
Small organic molecule
Emp. Form.:
C8H12N2O4
Mol. Mass.:
200.1919
SMILES:
OC[C@@H]1[C@@H](O)[C@H](O)[C@H](O)c2nccn12
: