Target
Presenilin-1
Ligand
BDBM28922
Substrate
Meas. Tech.
ChEMBL_968577 (CHEMBL2401297)
IC50
1.6±n/a nM
Citation
 Ye, XMKonradi, AWSun, MYuan, SAubele, DLDappen, MDressen, DGarofalo, AWJagodzinski, JJLatimer, LProbst, GDSham, HLWone, DXu, YZNess, DBrigham, EKwong, GTWilltis, CTonn, GGoldbach, EQuinn, KPZhang, HHSauer, JMBova, MBasi, GS Discovery of a novel [3.2.1] benzo fused bicyclic sulfonamide-pyrazoles as potent, selective and efficacious ?-secretase inhibitors. Bioorg Med Chem Lett 23:996-1000 (2013)  
Target
Name:
Presenilin-1
Synonyms:
3.4.23.- Gamma-Secretase Subunit Presenilin-1 PS1 PSEN1 PSNL1 Presenilin-1 CTF12 Protein S182
Type:
Mol. Mass.:
52657.13
Organism:
Homo sapiens (Human)
Description:
P49768
Residue:
467
  
Inhibitor
Name:
BDBM28922
Synonyms:
(2S)-N-(5-chlorothiophen-2-yl)-4,4,4-trifluoro-1-hydroxy-3-(trifluoromethyl)butane-2-sulfonamido GSI-953
Type:
Small organic molecule
Emp. Form.:
C9H8ClF6NO3S2
Mol. Mass.:
391.738
SMILES:
OC[C@@H](NS(=O)(=O)c1ccc(Cl)s1)C(C(F)(F)F)C(F)(F)F
: