Target
Rho-associated protein kinase 1
Ligand
BDBM14027
Substrate
Meas. Tech.
ChEMBL_1329797 (CHEMBL3226383)
IC50
260±n/a nM
Citation
 Pireddu, RForinash, KDSun, NNMartin, MPSung, SSAlexander, BZhu, JYGuida, WCSchönbrunn, ESebti, SMLawrence, NJ Pyridylthiazole-based ureas as inhibitors of Rho associated protein kinases (ROCK1 and 2). Medchemcomm 3:699-709 (2012)  
Target
Name:
Rho-associated protein kinase 1
Synonyms:
ROCK-I ROCK1_HUMAN Rho-associated protein kinase Rho-associated, coiled-coil-containing protein kinase 1 Rho-kinase (ROCK I) p160 ROCK-1 | p160ROCK
Type:
Serine/threonine-protein kinase
Mol. Mass.:
158156.77
Organism:
Homo sapiens (Human)
Description:
Q13464
Residue:
1354
  
Inhibitor
Name:
BDBM14027
Synonyms:
5-(1,4-diazepan-1-ylsulfonyl)isoquinoline AT877 CHEMBL541388 HA-1077 cid_163751
Type:
Small organic molecule
Emp. Form.:
C14H17N3O2S
Mol. Mass.:
291.369
SMILES:
O=S(=O)(N1CCCNCC1)c1cccc2cnccc12
: