Target
Diacylglycerol lipase-alpha
Ligand
BDBM50262188
Substrate
Meas. Tech.
ChEMBL_1547769 (CHEMBL3756328)
IC50
<10000±n/a nM
Citation
 Janssen, FJBaggelaar, MPHummel, JJOverkleeft, HSCravatt, BFBoger, DLvan der Stelt, M Comprehensive Analysis of Structure-Activity Relationships of ?-Ketoheterocycles as sn-1-Diacylglycerol Lipase ? Inhibitors. J Med Chem 58:9742-53 (2015)  
Target
Name:
Diacylglycerol lipase-alpha
Synonyms:
C11orf11 DGLA_HUMAN NSDDR | Sn1-specific diacylglycerol lipase alpha
Type:
PROTEIN
Mol. Mass.:
114947.74
Organism:
Homo sapiens (Human)
Description:
ChEMBL_1449471
Residue:
1042
  
Inhibitor
Name:
BDBM50262188
Synonyms:
1-(1,2,4-Oxadiazol-5-yl)-7-phenylheptan-1-one | CHEMBL448922
Type:
Small organic molecule
Emp. Form.:
C15H18N2O2
Mol. Mass.:
258.3156
SMILES:
O=C(CCCCCCc1ccccc1)c1ncno1
: