Target
Glutaminase kidney isoform, mitochondrial
Ligand
BDBM278480
Substrate
Meas. Tech.
ChEMBL_1809975 (CHEMBL4309435)
IC50
2300±n/a nM
Citation
 Zimmermann, SCDuvall, BTsukamoto, T Recent Progress in the Discovery of Allosteric Inhibitors of Kidney-Type Glutaminase. J Med Chem 62:46-59 (2019)  
Target
Name:
Glutaminase kidney isoform, mitochondrial
Synonyms:
GLS GLSK_HUMAN K-glutaminase L-glutamine amidohydrolase
Type:
Protein
Mol. Mass.:
73471.89
Organism:
Homo sapiens (Human)
Description:
O94925
Residue:
669
  
Inhibitor
Name:
BDBM278480
Synonyms:
(2R)-2-(dimethylamino)-N-[5-[[(3R)-1-pyridazin-3-ylpyrrolidin-3-yl]amino]-1,3,4-thiadiazol-2-yl]-2-[3-(trifluoromethoxy)phenyl]acetamide | US10040789, Example 14
Type:
Small organic molecule
Emp. Form.:
C21H23F3N8O2S
Mol. Mass.:
508.52
SMILES:
CN(C)[C@@H](C(=O)Nc1nnc(N[C@@H]2CCN(C2)c2cccnn2)s1)c1cccc(OC(F)(F)F)c1
: