Target
Glutaminase kidney isoform, mitochondrial
Ligand
BDBM50503298
Substrate
Meas. Tech.
ChEMBL_1809974 (CHEMBL4309434)
IC50
2.7±n/a nM
Citation
 Zimmermann, SCDuvall, BTsukamoto, T Recent Progress in the Discovery of Allosteric Inhibitors of Kidney-Type Glutaminase. J Med Chem 62:46-59 (2019)  
Target
Name:
Glutaminase kidney isoform, mitochondrial
Synonyms:
GLS GLSK_HUMAN K-glutaminase L-glutamine amidohydrolase
Type:
Protein
Mol. Mass.:
73471.89
Organism:
Homo sapiens (Human)
Description:
O94925
Residue:
669
  
Inhibitor
Name:
BDBM50503298
Synonyms:
CHEMBL4462146
Type:
Small organic molecule
Emp. Form.:
C23H26N10O2S2
Mol. Mass.:
538.648
SMILES:
Cn1ccc(CC(=O)Nc2nnc(s2)[C@H]2C[C@@]3(C[C@@H](C3)c3nnc(NC(=O)Cc4ccn(C)n4)s3)C2)n1
: