Target
Oxytocin receptor
Ligand
BDBM50056797
Substrate
Meas. Tech.
ChEMBL_149174 (CHEMBL762089)
Ki
6±n/a nM
Citation
 Chen, LZoulíková, ISlaninová, JBarany, G Synthesis and pharmacology of novel analogues of oxytocin and deaminooxytocin: directed methods for the construction of disulfide and trisulfide bridges in peptides. J Med Chem 40:864-76 (1997)  
Target
Name:
Oxytocin receptor
Synonyms:
OT-R Otr Oxytocin
Type:
Enzyme Catalytic Domain
Mol. Mass.:
42889.28
Organism:
RAT
Description:
Oxytocin OXTR RAT::P70536
Residue:
388
  
Inhibitor
Name:
BDBM50056797
Synonyms:
CHEMBL352836 | Oxytocin Trisulfide
Type:
Small organic molecule
Emp. Form.:
C43H65N11O12S3
Mol. Mass.:
1024.238
SMILES:
CC[C@H](C)[C@@H]1NC(=O)[C@H](Cc2ccc(O)cc2)NC(=O)CCSSSC[C@H](NC(=O)[C@H](CC(N)=O)NC(=O)[C@H](CCC(N)=O)NC1=O)C(=O)N1CCC[C@H]1C(=O)N[C@@H](CC(C)C)C(=O)NCC(N)=O
: