Target
Phosphatidylinositol 4,5-bisphosphate 3-kinase catalytic subunit delta isoform
Ligand
BDBM50506327
Substrate
Meas. Tech.
ChEMBL_1825529 (CHEMBL4325293)
IC50
3.2±n/a nM
Citation
 Henley, ZAAmour, ABarton, NBantscheff, MBergamini, GBertrand, SMConvery, MDown, KDümpelfeld, BEdwards, CDGrandi, PGore, PMKeeling, SLivia, SMallett, DMaxwell, APrice, MRau, CReinhard, FBMRowedder, JRowland, PTaylor, JAThomas, DAHessel, EMHamblin, JN Optimization of Orally Bioavailable PI3K? Inhibitors and Identification of Vps34 as a Key Selectivity Target. J Med Chem 63:638-655 (2020)  
Target
Name:
Phosphatidylinositol 4,5-bisphosphate 3-kinase catalytic subunit delta isoform
Synonyms:
PI3-kinase p110 subunit delta PI3-kinase subunit p110-delta PIK3CD Phosphatidylinositol 4,5-biphosphate 3-kinase catalytic subunit delta (PIK3CD) Phosphatidylinositol 4,5-bisphosphate 3-kinase 110 kDa catalytic subunit delta (PI3K delta) Phosphatidylinositol 4,5-bisphosphate 3-kinase catalytic subunit delta (PI3Kdelta) Phosphatidylinositol 4,5-bisphosphate 3-kinase catalytic subunit delta isoform (PI3K delta) Phosphatidylinositol 4,5-bisphosphate 3-kinase catalytic subunit delta isoform (PI3K-delta) Phosphatidylinositol 4,5-bisphosphate 3-kinase catalytic subunit delta isoform (PI3Kdelta)
Type:
Enzyme Subunit
Mol. Mass.:
119489.41
Organism:
Homo sapiens (Human)
Description:
O00329
Residue:
1044
  
Inhibitor
Name:
BDBM50506327
Synonyms:
CHEMBL4449047
Type:
Small organic molecule
Emp. Form.:
C28H41N3O7S
Mol. Mass.:
563.706
SMILES:
COCCS(=O)(=O)Nc1cc(cnc1OC)-c1cc2COCc2c(OC[C@@H](C)N2CCC(CC2)C(C)(C)O)c1
: