Target
Transitional endoplasmic reticulum ATPase
Ligand
BDBM50508309
Substrate
Meas. Tech.
ChEMBL_1832387 (CHEMBL4332395)
IC50
387±n/a nM
Citation
 Wang, XBai, EZhou, HSha, SMiao, HQin, YLiu, ZWang, JZhang, HLei, MLiu, JHai, OZhu, Y Discovery of a new class of valosine containing protein (VCP/P97) inhibitors for the treatment of non-small cell lung cancer. Bioorg Med Chem 27:533-544 (2019)  
Target
Name:
Transitional endoplasmic reticulum ATPase
Synonyms:
TERA_HUMAN VCP Valosin-containing protein
Type:
Enzyme
Mol. Mass.:
89300.63
Organism:
Homo sapiens (Human)
Description:
P55072
Residue:
806
  
Inhibitor
Name:
BDBM50508309
Synonyms:
CHEMBL4473427
Type:
Small organic molecule
Emp. Form.:
C29H32N6O2
Mol. Mass.:
496.6034
SMILES:
CN(C)C\C=C\C(=O)Nc1cccc2n(c(C)cc12)-c1nc2CCOCc2c(NCc2ccccc2)n1
: