Target
Transitional endoplasmic reticulum ATPase
Ligand
BDBM50508310
Substrate
Meas. Tech.
ChEMBL_1832387 (CHEMBL4332395)
IC50
308±n/a nM
Citation
 Wang, XBai, EZhou, HSha, SMiao, HQin, YLiu, ZWang, JZhang, HLei, MLiu, JHai, OZhu, Y Discovery of a new class of valosine containing protein (VCP/P97) inhibitors for the treatment of non-small cell lung cancer. Bioorg Med Chem 27:533-544 (2019)  
Target
Name:
Transitional endoplasmic reticulum ATPase
Synonyms:
TERA_HUMAN VCP Valosin-containing protein
Type:
Enzyme
Mol. Mass.:
89300.63
Organism:
Homo sapiens (Human)
Description:
P55072
Residue:
806
  
Inhibitor
Name:
BDBM50508310
Synonyms:
CHEMBL4576017
Type:
Small organic molecule
Emp. Form.:
C25H24ClN5O2
Mol. Mass.:
461.943
SMILES:
Cc1cc2c(NC(=O)CCl)cccc2n1-c1nc2CCOCc2c(NCc2ccccc2)n1
: