Target
Transitional endoplasmic reticulum ATPase
Ligand
BDBM50508312
Substrate
Meas. Tech.
ChEMBL_1832387 (CHEMBL4332395)
IC50
101±n/a nM
Citation
 Wang, XBai, EZhou, HSha, SMiao, HQin, YLiu, ZWang, JZhang, HLei, MLiu, JHai, OZhu, Y Discovery of a new class of valosine containing protein (VCP/P97) inhibitors for the treatment of non-small cell lung cancer. Bioorg Med Chem 27:533-544 (2019)  
Target
Name:
Transitional endoplasmic reticulum ATPase
Synonyms:
TERA_HUMAN VCP Valosin-containing protein
Type:
Enzyme
Mol. Mass.:
89300.63
Organism:
Homo sapiens (Human)
Description:
P55072
Residue:
806
  
Inhibitor
Name:
BDBM50508312
Synonyms:
CHEMBL4573319
Type:
Small organic molecule
Emp. Form.:
C24H22F3N5O3S
Mol. Mass.:
517.523
SMILES:
Cc1cc2c(NS(=O)(=O)C(F)(F)F)cccc2n1-c1nc2CCOCc2c(NCc2ccccc2)n1
: