Target
Integrin alpha-V/beta-3
Ligand
BDBM50061849
Substrate
Meas. Tech.
ChEMBL_214775 (CHEMBL816233)
IC50
>100000±n/a nM
Citation
 Su, TNaughton, MASmyth, MSRose, JWArfsten, AEMcCowan, JRJakubowski, JAWyss, VLRuterbories, KJSall, DJScarborough, RM Fibrinogen receptor (GPIIb-IIIa) antagonists derived from 5,6-bicyclic templates. Amidinoindoles, amidinoindazoles, and amidinobenzofurans containing the N-alpha-sulfonamide carboxylic acid function as potent platelet aggregation inhibitors. J Med Chem 40:4308-18 (1998)  
Target
Name:
Integrin alpha-V/beta-3
Synonyms:
ITGAV/ITGB3 | Integrin beta-3/Vitronectin receptor alpha
Type:
Enzyme
Mol. Mass.:
Description:
Components:
This complex has 2 components.
Component 1
Name:
Integrin alpha-V
Synonyms:
ITAV_HUMAN Integrin alpha-V/alpha-5 VNRA Vitronectin receptor | Vitronectin receptor subunit alpha
Type:
PROTEIN
Mol. Mass.:
116024.92
Organism:
Homo sapiens (Human)
Description:
ChEMBL_582336
Residue:
1048
  
Component 2
Name:
Integrin beta-3
Synonyms:
CD_antigen=CD61 GPIIIa ITGB3 Platelet membrane glycoprotein IIIa
Type:
Protein
Mol. Mass.:
87038.91
Organism:
Homo sapiens (Human)
Description:
P05106
Residue:
788
  
Inhibitor
Name:
BDBM50061849
Synonyms:
(S)-2-Benzenesulfonylamino-3-{3-[(5-carbamimidoyl-benzofuran-2-carbonyl)-amino]-propionylamino}-propionic acid CHEMBL116457
Type:
Small organic molecule
Emp. Form.:
C22H23N5O7S
Mol. Mass.:
501.512
SMILES:
NC(=N)c1ccc2oc(cc2c1)C(=O)NCCC(=O)NC[C@H](NS(=O)(=O)c1ccccc1)C(O)=O
: