Target
Matrix metalloproteinase-9
Ligand
BDBM50070233
Substrate
Meas. Tech.
ChEBML_105234
IC50
780±n/a nM
Citation
 Campbell, DAXiao, XYHarris, DIda, SMortezaei, RNgu, KShi, LTien, DWang, YNavre, MPatel, DVSharr, MADiJoseph, JFKillar, LMLeone, CLLevin, JISkotnicki, JS Malonyl alpha-mercaptoketones and alpha-mercaptoalcohols, a new class of matrix metalloproteinase inhibitors. Bioorg Med Chem Lett 8:1157-62 (1999)  
Target
Name:
Matrix metalloproteinase-9
Synonyms:
67 kDa matrix metalloproteinase-9 92 kDa gelatinase CLG4B Gelatinase B MMP9 Matrix metalloproteinase 9 (MMP-9) Matrix metalloproteinase-9 (MMP9)
Type:
Enzyme
Mol. Mass.:
78452.28
Organism:
Homo sapiens (Human)
Description:
P14780
Residue:
707
  
Inhibitor
Name:
BDBM50070233
Synonyms:
2-(1-Hydroxy-2-mercapto-ethyl)-nonanoic acid [(S)-1-(2-ethylamino-4-methyl-pentanoylcarbamoyl)-5-(toluene-4-sulfonylamino)-pentyl]-amide | CHEMBL278927
Type:
Small organic molecule
Emp. Form.:
C32H56N4O6S2
Mol. Mass.:
656.94
SMILES:
CCCCCCCC(C(O)CS)C(=O)N[C@@H](CCCCNS(=O)(=O)c1ccc(C)cc1)C(=O)NC(=O)C(CC(C)C)NCC
: