Target
Matrix metalloproteinase-9
Ligand
BDBM50070234
Substrate
Meas. Tech.
ChEBML_105234
IC50
19±n/a nM
Citation
 Campbell, DAXiao, XYHarris, DIda, SMortezaei, RNgu, KShi, LTien, DWang, YNavre, MPatel, DVSharr, MADiJoseph, JFKillar, LMLeone, CLLevin, JISkotnicki, JS Malonyl alpha-mercaptoketones and alpha-mercaptoalcohols, a new class of matrix metalloproteinase inhibitors. Bioorg Med Chem Lett 8:1157-62 (1999)  
Target
Name:
Matrix metalloproteinase-9
Synonyms:
67 kDa matrix metalloproteinase-9 92 kDa gelatinase CLG4B Gelatinase B MMP9 Matrix metalloproteinase 9 (MMP-9) Matrix metalloproteinase-9 (MMP9)
Type:
Enzyme
Mol. Mass.:
78452.28
Organism:
Homo sapiens (Human)
Description:
P14780
Residue:
707
  
Inhibitor
Name:
BDBM50070234
Synonyms:
2-(2-Mercapto-acetyl)-4-methyl-pentanoic acid [(S)-2,2-dimethyl-1-(pyridin-2-ylcarbamoyl)-propyl]-amide | CHEMBL16087
Type:
Small organic molecule
Emp. Form.:
C19H29N3O3S
Mol. Mass.:
379.517
SMILES:
CC(C)CC(C(=O)CS)C(=O)N[C@H](C(=O)Nc1ccccn1)C(C)(C)C
: