Target
Matrix metalloproteinase-9
Ligand
BDBM50070239
Substrate
Meas. Tech.
ChEBML_105234
IC50
6±n/a nM
Citation
 Campbell, DAXiao, XYHarris, DIda, SMortezaei, RNgu, KShi, LTien, DWang, YNavre, MPatel, DVSharr, MADiJoseph, JFKillar, LMLeone, CLLevin, JISkotnicki, JS Malonyl alpha-mercaptoketones and alpha-mercaptoalcohols, a new class of matrix metalloproteinase inhibitors. Bioorg Med Chem Lett 8:1157-62 (1999)  
Target
Name:
Matrix metalloproteinase-9
Synonyms:
67 kDa matrix metalloproteinase-9 92 kDa gelatinase CLG4B Gelatinase B MMP9 Matrix metalloproteinase 9 (MMP-9) Matrix metalloproteinase-9 (MMP9)
Type:
Enzyme
Mol. Mass.:
78452.28
Organism:
Homo sapiens (Human)
Description:
P14780
Residue:
707
  
Inhibitor
Name:
BDBM50070239
Synonyms:
2-(2-Mercapto-acetyl)-nonanoic acid [(S)-3-methyl-1-(2-morpholin-4-yl-ethylcarbamoyl)-butyl]-amide | CHEMBL16487
Type:
Small organic molecule
Emp. Form.:
C23H43N3O4S
Mol. Mass.:
457.67
SMILES:
CCCCCCCC(C(=O)CS)C(=O)N[C@@H](CC(C)C)C(=O)NCCN1CCOCC1
: