Target
Interstitial collagenase
Ligand
BDBM50070222
Substrate
Meas. Tech.
ChEBML_105964
IC50
890±n/a nM
Citation
 Campbell, DAXiao, XYHarris, DIda, SMortezaei, RNgu, KShi, LTien, DWang, YNavre, MPatel, DVSharr, MADiJoseph, JFKillar, LMLeone, CLLevin, JISkotnicki, JS Malonyl alpha-mercaptoketones and alpha-mercaptoalcohols, a new class of matrix metalloproteinase inhibitors. Bioorg Med Chem Lett 8:1157-62 (1999)  
Target
Name:
Interstitial collagenase
Synonyms:
CLG MMP1 Matrix metalloproteinase-1 | Matrix metalloproteinase-1 (MMP-1)
Type:
Enzyme
Mol. Mass.:
54010.26
Organism:
Homo sapiens (Human)
Description:
P03956
Residue:
469
  
Inhibitor
Name:
BDBM50070222
Synonyms:
2-(1-Hydroxy-2-mercapto-ethyl)-4-methyl-pentanoic acid [(S)-2,2-dimethyl-1-(pyridin-2-ylcarbamoyl)-propyl]-amide | CHEMBL16099
Type:
Small organic molecule
Emp. Form.:
C19H31N3O3S
Mol. Mass.:
381.533
SMILES:
CC(C)CC(C(O)CS)C(=O)N[C@H](C(=O)Nc1ccccn1)C(C)(C)C
: