Target
Interstitial collagenase
Ligand
BDBM50070228
Substrate
Meas. Tech.
ChEBML_105964
IC50
15±n/a nM
Citation
 Campbell, DAXiao, XYHarris, DIda, SMortezaei, RNgu, KShi, LTien, DWang, YNavre, MPatel, DVSharr, MADiJoseph, JFKillar, LMLeone, CLLevin, JISkotnicki, JS Malonyl alpha-mercaptoketones and alpha-mercaptoalcohols, a new class of matrix metalloproteinase inhibitors. Bioorg Med Chem Lett 8:1157-62 (1999)  
Target
Name:
Interstitial collagenase
Synonyms:
CLG MMP1 Matrix metalloproteinase-1 | Matrix metalloproteinase-1 (MMP-1)
Type:
Enzyme
Mol. Mass.:
54010.26
Organism:
Homo sapiens (Human)
Description:
P03956
Residue:
469
  
Inhibitor
Name:
BDBM50070228
Synonyms:
2-(2-Mercapto-acetyl)-nonanoic acid ((S)-2,2-dimethyl-1-methylcarbamoyl-propyl)-amide | CHEMBL16118
Type:
Small organic molecule
Emp. Form.:
C18H34N2O3S
Mol. Mass.:
358.539
SMILES:
CCCCCCCC(C(=O)CS)C(=O)N[C@H](C(=O)NC)C(C)(C)C
: