Target
Interstitial collagenase
Ligand
BDBM50070230
Substrate
Meas. Tech.
ChEBML_105964
IC50
>20±n/a nM
Citation
 Campbell, DAXiao, XYHarris, DIda, SMortezaei, RNgu, KShi, LTien, DWang, YNavre, MPatel, DVSharr, MADiJoseph, JFKillar, LMLeone, CLLevin, JISkotnicki, JS Malonyl alpha-mercaptoketones and alpha-mercaptoalcohols, a new class of matrix metalloproteinase inhibitors. Bioorg Med Chem Lett 8:1157-62 (1999)  
Target
Name:
Interstitial collagenase
Synonyms:
CLG MMP1 Matrix metalloproteinase-1 | Matrix metalloproteinase-1 (MMP-1)
Type:
Enzyme
Mol. Mass.:
54010.26
Organism:
Homo sapiens (Human)
Description:
P03956
Residue:
469
  
Inhibitor
Name:
BDBM50070230
Synonyms:
2-(1-Hydroxy-2-mercapto-ethyl)-nonanoic acid ((S)-3-methyl-1-phenethylcarbamoyl-butyl)-amide | CHEMBL15796
Type:
Small organic molecule
Emp. Form.:
C25H42N2O3S
Mol. Mass.:
450.678
SMILES:
CCCCCCCC(C(O)CS)C(=O)N[C@@H](CC(C)C)C(=O)NCCc1ccccc1
: