Target
Stromelysin-1
Ligand
BDBM50070232
Substrate
Meas. Tech.
ChEBML_104711
IC50
140±n/a nM
Citation
 Campbell, DAXiao, XYHarris, DIda, SMortezaei, RNgu, KShi, LTien, DWang, YNavre, MPatel, DVSharr, MADiJoseph, JFKillar, LMLeone, CLLevin, JISkotnicki, JS Malonyl alpha-mercaptoketones and alpha-mercaptoalcohols, a new class of matrix metalloproteinase inhibitors. Bioorg Med Chem Lett 8:1157-62 (1999)  
Target
Name:
Stromelysin-1
Synonyms:
MMP-3 MMP3_HUMAN Matrix metalloproteinase 3 Matrix metalloproteinase-3 (MMP-3) SL-1 Stromelysin 1 | Transin-1
Type:
Enzyme
Mol. Mass.:
53973.13
Organism:
Homo sapiens (Human)
Description:
P08254
Residue:
477
  
Inhibitor
Name:
BDBM50070232
Synonyms:
2-Ethylamino-4-methyl-pentanoic acid {(S)-2-[2-(2-mercapto-acetyl)-5-phenyl-pentanoylamino]-4-methyl-pentanoyl}-amide | CHEMBL16235
Type:
Small organic molecule
Emp. Form.:
C27H43N3O4S
Mol. Mass.:
505.713
SMILES:
CCNC(CC(C)C)C(=O)NC(=O)[C@H](CC(C)C)NC(=O)C(CCCc1ccccc1)C(=O)CS
: