Target
Stromelysin-1
Ligand
BDBM50070234
Substrate
Meas. Tech.
ChEBML_104711
IC50
160±n/a nM
Citation
 Campbell, DAXiao, XYHarris, DIda, SMortezaei, RNgu, KShi, LTien, DWang, YNavre, MPatel, DVSharr, MADiJoseph, JFKillar, LMLeone, CLLevin, JISkotnicki, JS Malonyl alpha-mercaptoketones and alpha-mercaptoalcohols, a new class of matrix metalloproteinase inhibitors. Bioorg Med Chem Lett 8:1157-62 (1999)  
Target
Name:
Stromelysin-1
Synonyms:
MMP-3 MMP3_HUMAN Matrix metalloproteinase 3 Matrix metalloproteinase-3 (MMP-3) SL-1 Stromelysin 1 | Transin-1
Type:
Enzyme
Mol. Mass.:
53973.13
Organism:
Homo sapiens (Human)
Description:
P08254
Residue:
477
  
Inhibitor
Name:
BDBM50070234
Synonyms:
2-(2-Mercapto-acetyl)-4-methyl-pentanoic acid [(S)-2,2-dimethyl-1-(pyridin-2-ylcarbamoyl)-propyl]-amide | CHEMBL16087
Type:
Small organic molecule
Emp. Form.:
C19H29N3O3S
Mol. Mass.:
379.517
SMILES:
CC(C)CC(C(=O)CS)C(=O)N[C@H](C(=O)Nc1ccccn1)C(C)(C)C
: