Target
Interstitial collagenase
Ligand
BDBM50070241
Substrate
Meas. Tech.
ChEBML_105964
IC50
>10±n/a nM
Citation
 Campbell, DAXiao, XYHarris, DIda, SMortezaei, RNgu, KShi, LTien, DWang, YNavre, MPatel, DVSharr, MADiJoseph, JFKillar, LMLeone, CLLevin, JISkotnicki, JS Malonyl alpha-mercaptoketones and alpha-mercaptoalcohols, a new class of matrix metalloproteinase inhibitors. Bioorg Med Chem Lett 8:1157-62 (1999)  
Target
Name:
Interstitial collagenase
Synonyms:
CLG MMP1 Matrix metalloproteinase-1 | Matrix metalloproteinase-1 (MMP-1)
Type:
Enzyme
Mol. Mass.:
54010.26
Organism:
Homo sapiens (Human)
Description:
P03956
Residue:
469
  
Inhibitor
Name:
BDBM50070241
Synonyms:
2-(2-Mercapto-acetyl)-nonanoic acid [(S)-1-(2-ethylamino-4-methyl-pentanoylaminocarbonyl)-3-methyl-butyl]-amide | CHEMBL16115
Type:
Small organic molecule
Emp. Form.:
C25H47N3O4S
Mol. Mass.:
485.723
SMILES:
CCCCCCCC(C(=O)CS)C(=O)N[C@@H](CC(C)C)C(=O)NC(=O)C(CC(C)C)NCC
: