Target
Stromelysin-1
Ligand
BDBM50070238
Substrate
Meas. Tech.
ChEBML_104711
IC50
290±n/a nM
Citation
 Campbell, DAXiao, XYHarris, DIda, SMortezaei, RNgu, KShi, LTien, DWang, YNavre, MPatel, DVSharr, MADiJoseph, JFKillar, LMLeone, CLLevin, JISkotnicki, JS Malonyl alpha-mercaptoketones and alpha-mercaptoalcohols, a new class of matrix metalloproteinase inhibitors. Bioorg Med Chem Lett 8:1157-62 (1999)  
Target
Name:
Stromelysin-1
Synonyms:
MMP-3 MMP3_HUMAN Matrix metalloproteinase 3 Matrix metalloproteinase-3 (MMP-3) SL-1 Stromelysin 1 | Transin-1
Type:
Enzyme
Mol. Mass.:
53973.13
Organism:
Homo sapiens (Human)
Description:
P08254
Residue:
477
  
Inhibitor
Name:
BDBM50070238
Synonyms:
2-(1-Hydroxy-2-mercapto-ethyl)-nonanoic acid {(S)-2-cyclohexyl-1-[2-(4-sulfamoyl-phenyl)-ethylcarbamoyl]-ethyl}-amide | CHEMBL16213
Type:
Small organic molecule
Emp. Form.:
C28H47N3O5S2
Mol. Mass.:
569.82
SMILES:
CCCCCCCC(C(O)CS)C(=O)N[C@@H](CC1CCCCC1)C(=O)NCCc1ccc(cc1)S(N)(=O)=O
: