Target
Interstitial collagenase
Ligand
BDBM50070233
Substrate
Meas. Tech.
ChEBML_105964
IC50
>10±n/a nM
Citation
 Campbell, DAXiao, XYHarris, DIda, SMortezaei, RNgu, KShi, LTien, DWang, YNavre, MPatel, DVSharr, MADiJoseph, JFKillar, LMLeone, CLLevin, JISkotnicki, JS Malonyl alpha-mercaptoketones and alpha-mercaptoalcohols, a new class of matrix metalloproteinase inhibitors. Bioorg Med Chem Lett 8:1157-62 (1999)  
Target
Name:
Interstitial collagenase
Synonyms:
CLG MMP1 Matrix metalloproteinase-1 | Matrix metalloproteinase-1 (MMP-1)
Type:
Enzyme
Mol. Mass.:
54010.26
Organism:
Homo sapiens (Human)
Description:
P03956
Residue:
469
  
Inhibitor
Name:
BDBM50070233
Synonyms:
2-(1-Hydroxy-2-mercapto-ethyl)-nonanoic acid [(S)-1-(2-ethylamino-4-methyl-pentanoylcarbamoyl)-5-(toluene-4-sulfonylamino)-pentyl]-amide | CHEMBL278927
Type:
Small organic molecule
Emp. Form.:
C32H56N4O6S2
Mol. Mass.:
656.94
SMILES:
CCCCCCCC(C(O)CS)C(=O)N[C@@H](CCCCNS(=O)(=O)c1ccc(C)cc1)C(=O)NC(=O)C(CC(C)C)NCC
: