Target
Stromelysin-1
Ligand
BDBM50070227
Substrate
Meas. Tech.
ChEBML_104711
IC50
88±n/a nM
Citation
 Campbell, DAXiao, XYHarris, DIda, SMortezaei, RNgu, KShi, LTien, DWang, YNavre, MPatel, DVSharr, MADiJoseph, JFKillar, LMLeone, CLLevin, JISkotnicki, JS Malonyl alpha-mercaptoketones and alpha-mercaptoalcohols, a new class of matrix metalloproteinase inhibitors. Bioorg Med Chem Lett 8:1157-62 (1999)  
Target
Name:
Stromelysin-1
Synonyms:
MMP-3 MMP3_HUMAN Matrix metalloproteinase 3 Matrix metalloproteinase-3 (MMP-3) SL-1 Stromelysin 1 | Transin-1
Type:
Enzyme
Mol. Mass.:
53973.13
Organism:
Homo sapiens (Human)
Description:
P08254
Residue:
477
  
Inhibitor
Name:
BDBM50070227
Synonyms:
2-(2-Mercapto-acetyl)-nonanoic acid ((S)-3-methyl-1-phenylcarbamoyl-butyl)-amide | CHEMBL15763
Type:
Small organic molecule
Emp. Form.:
C23H36N2O3S
Mol. Mass.:
420.609
SMILES:
CCCCCCCC(C(=O)CS)C(=O)N[C@@H](CC(C)C)C(=O)Nc1ccccc1
: