Target
Stromelysin-1
Ligand
BDBM50070242
Substrate
Meas. Tech.
ChEBML_104711
IC50
28±n/a nM
Citation
 Campbell, DAXiao, XYHarris, DIda, SMortezaei, RNgu, KShi, LTien, DWang, YNavre, MPatel, DVSharr, MADiJoseph, JFKillar, LMLeone, CLLevin, JISkotnicki, JS Malonyl alpha-mercaptoketones and alpha-mercaptoalcohols, a new class of matrix metalloproteinase inhibitors. Bioorg Med Chem Lett 8:1157-62 (1999)  
Target
Name:
Stromelysin-1
Synonyms:
MMP-3 MMP3_HUMAN Matrix metalloproteinase 3 Matrix metalloproteinase-3 (MMP-3) SL-1 Stromelysin 1 | Transin-1
Type:
Enzyme
Mol. Mass.:
53973.13
Organism:
Homo sapiens (Human)
Description:
P08254
Residue:
477
  
Inhibitor
Name:
BDBM50070242
Synonyms:
2-(2-Mercapto-acetyl)-nonanoic acid [(S)-1-(2-ethylamino-4-methyl-pentanoylaminocarbonyl)-pentyl]-amide | CHEMBL16474
Type:
Small organic molecule
Emp. Form.:
C25H47N3O4S
Mol. Mass.:
485.723
SMILES:
CCCCCCCC(C(=O)CS)C(=O)N[C@@H](CCCC)C(=O)NC(=O)C(CC(C)C)NCC
: