Target
Stromelysin-1
Ligand
BDBM50070250
Substrate
Meas. Tech.
ChEBML_104711
IC50
>2±n/a nM
Citation
 Campbell, DAXiao, XYHarris, DIda, SMortezaei, RNgu, KShi, LTien, DWang, YNavre, MPatel, DVSharr, MADiJoseph, JFKillar, LMLeone, CLLevin, JISkotnicki, JS Malonyl alpha-mercaptoketones and alpha-mercaptoalcohols, a new class of matrix metalloproteinase inhibitors. Bioorg Med Chem Lett 8:1157-62 (1999)  
Target
Name:
Stromelysin-1
Synonyms:
MMP-3 MMP3_HUMAN Matrix metalloproteinase 3 Matrix metalloproteinase-3 (MMP-3) SL-1 Stromelysin 1 | Transin-1
Type:
Enzyme
Mol. Mass.:
53973.13
Organism:
Homo sapiens (Human)
Description:
P08254
Residue:
477
  
Inhibitor
Name:
BDBM50070250
Synonyms:
2-(1-Hydroxy-2-mercapto-ethyl)-5-phenyl-pentanoic acid ((S)-2-cyclohexyl-1-phenethylcarbamoyl-ethyl)-amide | CHEMBL15920
Type:
Small organic molecule
Emp. Form.:
C30H42N2O3S
Mol. Mass.:
510.731
SMILES:
OC(CS)C(CCCc1ccccc1)C(=O)N[C@@H](CC1CCCCC1)C(=O)NCCc1ccccc1
: