Target
Nuclear receptor subfamily 4 group A member 2
Ligand
BDBM50517830
Substrate
Meas. Tech.
ChEMBL_1869815 (CHEMBL4370881)
EC50
>1000±n/a nM
Citation
 Lesuisse, DMalanda, APeyronel, JFEvanno, YLardenois, PDe-Peretti, DAbécassis, PYBarnéoud, PBrunel, PBurgevin, MCCegarra, CAuger, FDommergue, ALafon, CEven, LTsi, JLuc, TPHAlmario, AOlivier, ACastel, MNTaupin, VRooney, TVigé, X Development of a novel NURR1/NOT agonist from hit to lead and candidate for the potential treatment of Parkinson's disease. Bioorg Med Chem Lett 29:929-932 (2019)  
Target
Name:
Nuclear receptor subfamily 4 group A member 2
Synonyms:
NOT NR4A2_HUMAN TINUR
Type:
PROTEIN
Mol. Mass.:
66603.77
Organism:
Homo sapiens (Human)
Description:
ChEMBL_453027
Residue:
598
  
Inhibitor
Name:
BDBM50517830
Synonyms:
CHEMBL4475835
Type:
Small organic molecule
Emp. Form.:
C19H12F2N4O
Mol. Mass.:
350.3216
SMILES:
Fc1cccc(NC(=O)c2cn3cc(ccc3n2)-c2ccccn2)c1F
: